{"text_format":"1","workbook":"xlsx","n_sheets":6,"sheets":["SelOpts (hidden)","Step 00 - ReadMe","Step 01 - Select","Step 02 - Data Entry","Step 03 - Output Report","Sheet1"],"not_rendered":{"charts":0,"images":5,"macros":1,"external_links":0,"defined_names":15,"comments":1,"pivot_tables":0},"unopened":[],"bounds":{"document_bytes":16777216,"sheet_cells":100000,"rows_first":2000,"rows_last":500,"rows_between":2000,"halvings":0,"cell_chars":16384,"cell_head_chars":4096},"cells_cut":0,"cells_raw":0,"read":"whole","date_system":"1900"}

{"sheet":"SelOpts (hidden)","index":0,"n_rows":52,"n_cols":3,"rows_kept":52,"cut":false,"hidden":true,"merged":[]}
[]
[]
[]
[]
["Antibiotics (SelA)"]
["ID","DESCRIPTION","ORAL_IV"]
["A1","Ampicillin",1]
["A2","Amoxicillin/Clavunate",2]
["A3","Ampicillin/Sulbactam",2]
["A4","Bactrim (Trimethoprim/Sulfamethoxazole)",2]
["A5","Cefazolin",1]
["A6","Cefepime",2]
["A7","Cefoxitin",1]
["A8","Ceftazidime",2]
["A9","Ceftriaxone",1]
["A10","Ciprofloxacin",1]
["A11","Clindamycin",1]
["A12","Erythromycin",1]
["A13","Gentamicin",2]
["A14","Imipenem",2]
["A15","Levofloxacin",1]
["A16","Linezolid",1]
["A17","Nitrofurantoin",1]
["A18","Oxacillin"]
["A19","Pipercillin/Tazobactam"]
["A20","Tetracycline",1]
["A21","Vancomycin",2]
["A22","…"]
[]
[]
["Bacteria (SelB)"]
["ID","DESCRIPTION","GRAM"]
["B1","Escherichia coli","N"]
["B2","Klebsiella pneumoniae","N"]
["B3","Proteus mirabilis","N"]
["B4","Pseudomonas aeruginosa","N"]
["B5","non-MRSA Staphylococcus aureus","P"]
["B6","MRSA Staphylococcus aureus","P"]
["B7","Staphylococcus coag. Negative","P"]
["B8","non-Vancomycin resistant Enterococcus species","P"]
["B9","Vancomycin resistant Enterococcus species","P"]
["B10","…"]
[]
[]
["Cultures (SelC)"]
["ID","DESCRIPTION"]
["C1","Blood"]
["C2","Urine"]
["C3","Sputum"]
["C4","Wound"]
["C5","Combined"]
["C7","…"]

{"sheet":"Step 00 - ReadMe","index":1,"n_rows":10,"n_cols":2,"rows_kept":10,"cut":false,"hidden":false,"merged":[]}
[]
[null,"Antibiograms README"]
[]
[null,"This workbook provides data entry forms that generate an antibiogram report based on a user's selection of antibiotics, bacteria, and cultures. The data entry tables and output reports are programmatically generated based on the user's input and all flexible and customizable. There are three steps — selection, data entry, and output report. Use the navigation pane on the top of each sheet to navigate between steps; clicking these buttons will automatically activate the spreadsheet changes."]
[]
[null,"Use step 1 to enter the nursing home's address and contact information and to select the antibiotics, bacteria, and cultures to be included in the antibiogram."]
[null,"Use step 2 to enter the number of isolates and percents for each of the bacteria-antibiotic-culture combinations. The data entry sheet will have changed to reflect the user's  step 1 selections. Each box corresponds to a bacteria, each row to an antibiotic, and each column to a culture type."]
[null,"Use step 3 to generate an output report based on the data input in step 2, which provides the weighted average over all the selected isolates/percents for each bacteria-antibiotic combination."]
[]
[null,"The lists of antibiotics, bacteria, and cultures are fully customizable, and the rest of the workbook will change to reflect any changes to the size and contents of the lists in the hidden sheet \"SelOpts.\" When making changes to these lists, be sure to use the Excel functions to insert or delete any of the whole rows above the end of the list, marked as \"...\".  The auxiliary columns for bacteria (GRAM) and for antibiotics (ORAL_IV) are important to fill out, as changes here will be reflected in the output report. Similarly, the order of these lists determines the order of the data entry forms and output report."]

{"sheet":"Step 01 - Select","index":2,"n_rows":37,"n_cols":10,"rows_kept":37,"cut":false,"hidden":false,"merged":[[14,1,14,2],[15,1,15,2],[11,3,11,6],[12,3,12,6],[13,3,13,6],[14,3,14,6],[15,3,15,6],[13,1,13,2],[5,2,5,6],[6,2,6,6],[7,2,7,6],[11,1,11,2],[12,1,12,2]]}
[]
[]
[]
[]
[null,"Nursing Home:"]
[null,"Name","VA Nursing Home of JP"]
[null,"Address 1","150 Valparaiso Ave"]
[null,"Address 2","Suit 100"]
[null,"City","Houston",null,"TX","Zip",77095]
[]
[null,"Contacts:"]
[null,"NH Director",null,"Jon Doe"]
[null,"Medical Director",null,"David Pont"]
[null,"Director of Nursing",null,"Kiki Wiki"]
[null,"Infection Control Specialist/Nurse",null,"Phemi Nemorroni"]
[null,"Project Champion",null,"Johannes Fizzle"]
[]
[null,"Reporting Period "]
[null,"From:","2010-12-02","To:","2011-01-31"]
[]
[null,"Select Antibiotics:",null,null,"Select Bacteria:",null,null,null,"Select Culture:"]
[]
[]
[]
[]
[]
[]
[]
[]
[]
[]
[]
[]
[]
[]
[null,null,null,null,null,null,null,null,"AHRQ Pub. No. 17-0006-7-EF"]
[null,null,null,null,"Nursing Home Antimicrobial Stewardship Guide",null,null,null,null,"        2016 October"]

{"sheet":"Step 02 - Data Entry","index":3,"n_rows":247,"n_cols":16,"rows_kept":247,"cut":false,"hidden":false,"merged":[[5,6,5,15],[4,4,4,15]]}
[]
[]
[]
["Bacteria","Antibiotic","QA"]
["B1","A0",null,null,"Nursing Home Antimicrobial Stewardship Guide"]
["B1","A0",null,null,"Escherichia coli"]
["B1","A0",null,null,null,null,"Culture: Blood",null,"Culture: Urine",null,"Culture: Sputum",null,"Culture: Wound",null,"Culture: Combined"]
["B1","A0",null,null,null,null,"# of Isolates","Percent","# of Isolates","Percent","# of Isolates","Percent","# of Isolates","Percent","# of Isolates","Percent"]
["B1","A1",null,null,null,"Ampicillin"]
["B1","A2",null,null,null,"Amoxicillin/Clavunate"]
["B1","A3",null,null,null,"Ampicillin/Sulbactam"]
["B1","A4",null,null,null,"Bactrim (Trimethoprim/Sulfamethoxazole)"]
["B1","A5",null,null,null,"Cefazolin"]
["B1","A6",null,null,null,"Cefepime"]
["B1","A7",null,null,null,"Cefoxitin"]
["B1","A8",null,null,null,"Ceftazidime"]
["B1","A9",null,null,null,"Ceftriaxone"]
["B1","A10",null,null,null,"Ciprofloxacin"]
["B1","A11",null,null,null,"Clindamycin"]
["B1","A12",null,null,null,"Erythromycin"]
["B1","A13",null,null,null,"Gentamicin"]
["B1","A14",null,null,null,"Imipenem"]
["B1","A15",null,null,null,"Levofloxacin"]
["B1","A16",null,null,null,"Linezolid"]
["B1","A17",null,null,null,"Nitrofurantoin"]
["B1","A18",null,null,null,"Oxacillin"]
["B1","A19",null,null,null,"Pipercillin/Tazobactam"]
["B1","A20",null,null,null,"Tetracycline"]
["B1","A21",null,null,null,"Vancomycin"]
["B1","A0"]
["B1","A0"]
["B2","A0"]
["B2","A0",null,null,"Klebsiella pneumoniae"]
["B2","A0",null,null,null,null,"Culture: Blood",null,"Culture: Urine",null,"Culture: Sputum",null,"Culture: Wound",null,"Culture: Combined"]
["B2","A0",null,null,null,null,"# of Isolates","Percent","# of Isolates","Percent","# of Isolates","Percent","# of Isolates","Percent","# of Isolates","Percent"]
["B2","A1",null,null,null,"Ampicillin"]
["B2","A2",null,null,null,"Amoxicillin/Clavunate"]
["B2","A3",null,null,null,"Ampicillin/Sulbactam"]
["B2","A4",null,null,null,"Bactrim (Trimethoprim/Sulfamethoxazole)"]
["B2","A5",null,null,null,"Cefazolin"]
["B2","A6",null,null,null,"Cefepime"]
["B2","A7",null,null,null,"Cefoxitin"]
["B2","A8",null,null,null,"Ceftazidime"]
["B2","A9",null,null,null,"Ceftriaxone"]
["B2","A10",null,null,null,"Ciprofloxacin"]
["B2","A11",null,null,null,"Clindamycin"]
["B2","A12",null,null,null,"Erythromycin"]
["B2","A13",null,null,null,"Gentamicin"]
["B2","A14",null,null,null,"Imipenem"]
["B2","A15",null,null,null,"Levofloxacin"]
["B2","A16",null,null,null,"Linezolid"]
["B2","A17",null,null,null,"Nitrofurantoin"]
["B2","A18",null,null,null,"Oxacillin"]
["B2","A19",null,null,null,"Pipercillin/Tazobactam"]
["B2","A20",null,null,null,"Tetracycline"]
["B2","A21",null,null,null,"Vancomycin"]
["B2","A0"]
["B2","A0"]
["B3","A0"]
["B3","A0",null,null,"Proteus mirabilis"]
["B3","A0",null,null,null,null,"Culture: Blood",null,"Culture: Urine",null,"Culture: Sputum",null,"Culture: Wound",null,"Culture: Combined"]
["B3","A0",null,null,null,null,"# of Isolates","Percent","# of Isolates","Percent","# of Isolates","Percent","# of Isolates","Percent","# of Isolates","Percent"]
["B3","A1",null,null,null,"Ampicillin"]
["B3","A2",null,null,null,"Amoxicillin/Clavunate"]
["B3","A3",null,null,null,"Ampicillin/Sulbactam"]
["B3","A4",null,null,null,"Bactrim (Trimethoprim/Sulfamethoxazole)"]
["B3","A5",null,null,null,"Cefazolin"]
["B3","A6",null,null,null,"Cefepime"]
["B3","A7",null,null,null,"Cefoxitin"]
["B3","A8",null,null,null,"Ceftazidime"]
["B3","A9",null,null,null,"Ceftriaxone"]
["B3","A10",null,null,null,"Ciprofloxacin"]
["B3","A11",null,null,null,"Clindamycin"]
["B3","A12",null,null,null,"Erythromycin"]
["B3","A13",null,null,null,"Gentamicin"]
["B3","A14",null,null,null,"Imipenem"]
["B3","A15",null,null,null,"Levofloxacin"]
["B3","A16",null,null,null,"Linezolid"]
["B3","A17",null,null,null,"Nitrofurantoin"]
["B3","A18",null,null,null,"Oxacillin"]
["B3","A19",null,null,null,"Pipercillin/Tazobactam"]
["B3","A20",null,null,null,"Tetracycline"]
["B3","A21",null,null,null,"Vancomycin"]
["B3","A0"]
["B3","A0"]
["B4","A0"]
["B4","A0",null,null,"Pseudomonas aeruginosa"]
["B4","A0",null,null,null,null,"Culture: Blood",null,"Culture: Urine",null,"Culture: Sputum",null,"Culture: Wound",null,"Culture: Combined"]
["B4","A0",null,null,null,null,"# of Isolates","Percent","# of Isolates","Percent","# of Isolates","Percent","# of Isolates","Percent","# of Isolates","Percent"]
["B4","A1",null,null,null,"Ampicillin"]
["B4","A2",null,null,null,"Amoxicillin/Clavunate"]
["B4","A3",null,null,null,"Ampicillin/Sulbactam"]
["B4","A4",null,null,null,"Bactrim (Trimethoprim/Sulfamethoxazole)"]
["B4","A5",null,null,null,"Cefazolin"]
["B4","A6",null,null,null,"Cefepime"]
["B4","A7",null,null,null,"Cefoxitin"]
["B4","A8",null,null,null,"Ceftazidime"]
["B4","A9",null,null,null,"Ceftriaxone"]
["B4","A10",null,null,null,"Ciprofloxacin"]
["B4","A11",null,null,null,"Clindamycin"]
["B4","A12",null,null,null,"Erythromycin"]
["B4","A13",null,null,null,"Gentamicin"]
["B4","A14",null,null,null,"Imipenem"]
["B4","A15",null,null,null,"Levofloxacin"]
["B4","A16",null,null,null,"Linezolid"]
["B4","A17",null,null,null,"Nitrofurantoin"]
["B4","A18",null,null,null,"Oxacillin"]
["B4","A19",null,null,null,"Pipercillin/Tazobactam"]
["B4","A20",null,null,null,"Tetracycline"]
["B4","A21",null,null,null,"Vancomycin"]
["B4","A0"]
["B4","A0"]
["B5","A0"]
["B5","A0",null,null,"non-MRSA Staphylococcus aureus"]
["B5","A0",null,null,null,null,"Culture: Blood",null,"Culture: Urine",null,"Culture: Sputum",null,"Culture: Wound",null,"Culture: Combined"]
["B5","A0",null,null,null,null,"# of Isolates","Percent","# of Isolates","Percent","# of Isolates","Percent","# of Isolates","Percent","# of Isolates","Percent"]
["B5","A1",null,null,null,"Ampicillin"]
["B5","A2",null,null,null,"Amoxicillin/Clavunate"]
["B5","A3",null,null,null,"Ampicillin/Sulbactam"]
["B5","A4",null,null,null,"Bactrim (Trimethoprim/Sulfamethoxazole)"]
["B5","A5",null,null,null,"Cefazolin"]
["B5","A6",null,null,null,"Cefepime"]
["B5","A7",null,null,null,"Cefoxitin"]
["B5","A8",null,null,null,"Ceftazidime"]
["B5","A9",null,null,null,"Ceftriaxone"]
["B5","A10",null,null,null,"Ciprofloxacin"]
["B5","A11",null,null,null,"Clindamycin"]
["B5","A12",null,null,null,"Erythromycin"]
["B5","A13",null,null,null,"Gentamicin"]
["B5","A14",null,null,null,"Imipenem"]
["B5","A15",null,null,null,"Levofloxacin"]
["B5","A16",null,null,null,"Linezolid"]
["B5","A17",null,null,null,"Nitrofurantoin"]
["B5","A18",null,null,null,"Oxacillin"]
["B5","A19",null,null,null,"Pipercillin/Tazobactam"]
["B5","A20",null,null,null,"Tetracycline"]
["B5","A21",null,null,null,"Vancomycin"]
["B5","A0"]
["B5","A0"]
["B6","A0"]
["B6","A0",null,null,"MRSA Staphylococcus aureus"]
["B6","A0",null,null,null,null,"Culture: Blood",null,"Culture: Urine",null,"Culture: Sputum",null,"Culture: Wound",null,"Culture: Combined"]
["B6","A0",null,null,null,null,"# of Isolates","Percent","# of Isolates","Percent","# of Isolates","Percent","# of Isolates","Percent","# of Isolates","Percent"]
["B6","A1",null,null,null,"Ampicillin"]
["B6","A2",null,null,null,"Amoxicillin/Clavunate"]
["B6","A3",null,null,null,"Ampicillin/Sulbactam"]
["B6","A4",null,null,null,"Bactrim (Trimethoprim/Sulfamethoxazole)"]
["B6","A5",null,null,null,"Cefazolin"]
["B6","A6",null,null,null,"Cefepime"]
["B6","A7",null,null,null,"Cefoxitin"]
["B6","A8",null,null,null,"Ceftazidime"]
["B6","A9",null,null,null,"Ceftriaxone"]
["B6","A10",null,null,null,"Ciprofloxacin"]
["B6","A11",null,null,null,"Clindamycin"]
["B6","A12",null,null,null,"Erythromycin"]
["B6","A13",null,null,null,"Gentamicin"]
["B6","A14",null,null,null,"Imipenem"]
["B6","A15",null,null,null,"Levofloxacin"]
["B6","A16",null,null,null,"Linezolid"]
["B6","A17",null,null,null,"Nitrofurantoin"]
["B6","A18",null,null,null,"Oxacillin"]
["B6","A19",null,null,null,"Pipercillin/Tazobactam"]
["B6","A20",null,null,null,"Tetracycline"]
["B6","A21",null,null,null,"Vancomycin"]
["B6","A0"]
["B6","A0"]
["B7","A0"]
["B7","A0",null,null,"Staphylococcus coag. Negative"]
["B7","A0",null,null,null,null,"Culture: Blood",null,"Culture: Urine",null,"Culture: Sputum",null,"Culture: Wound",null,"Culture: Combined"]
["B7","A0",null,null,null,null,"# of Isolates","Percent","# of Isolates","Percent","# of Isolates","Percent","# of Isolates","Percent","# of Isolates","Percent"]
["B7","A1",null,null,null,"Ampicillin"]
["B7","A2",null,null,null,"Amoxicillin/Clavunate"]
["B7","A3",null,null,null,"Ampicillin/Sulbactam"]
["B7","A4",null,null,null,"Bactrim (Trimethoprim/Sulfamethoxazole)"]
["B7","A5",null,null,null,"Cefazolin"]
["B7","A6",null,null,null,"Cefepime"]
["B7","A7",null,null,null,"Cefoxitin"]
["B7","A8",null,null,null,"Ceftazidime"]
["B7","A9",null,null,null,"Ceftriaxone"]
["B7","A10",null,null,null,"Ciprofloxacin"]
["B7","A11",null,null,null,"Clindamycin"]
["B7","A12",null,null,null,"Erythromycin"]
["B7","A13",null,null,null,"Gentamicin"]
["B7","A14",null,null,null,"Imipenem"]
["B7","A15",null,null,null,"Levofloxacin"]
["B7","A16",null,null,null,"Linezolid"]
["B7","A17",null,null,null,"Nitrofurantoin"]
["B7","A18",null,null,null,"Oxacillin"]
["B7","A19",null,null,null,"Pipercillin/Tazobactam"]
["B7","A20",null,null,null,"Tetracycline"]
["B7","A21",null,null,null,"Vancomycin"]
["B7","A0"]
["B7","A0"]
["B8","A0"]
["B8","A0",null,null,"non-Vancomycin resistant Enterococcus species"]
["B8","A0",null,null,null,null,"Culture: Blood",null,"Culture: Urine",null,"Culture: Sputum",null,"Culture: Wound",null,"Culture: Combined"]
["B8","A0",null,null,null,null,"# of Isolates","Percent","# of Isolates","Percent","# of Isolates","Percent","# of Isolates","Percent","# of Isolates","Percent"]
["B8","A1",null,null,null,"Ampicillin"]
["B8","A2",null,null,null,"Amoxicillin/Clavunate"]
["B8","A3",null,null,null,"Ampicillin/Sulbactam"]
["B8","A4",null,null,null,"Bactrim (Trimethoprim/Sulfamethoxazole)"]
["B8","A5",null,null,null,"Cefazolin"]
["B8","A6",null,null,null,"Cefepime"]
["B8","A7",null,null,null,"Cefoxitin"]
["B8","A8",null,null,null,"Ceftazidime"]
["B8","A9",null,null,null,"Ceftriaxone"]
["B8","A10",null,null,null,"Ciprofloxacin"]
["B8","A11",null,null,null,"Clindamycin"]
["B8","A12",null,null,null,"Erythromycin"]
["B8","A13",null,null,null,"Gentamicin"]
["B8","A14",null,null,null,"Imipenem"]
["B8","A15",null,null,null,"Levofloxacin"]
["B8","A16",null,null,null,"Linezolid"]
["B8","A17",null,null,null,"Nitrofurantoin"]
["B8","A18",null,null,null,"Oxacillin"]
["B8","A19",null,null,null,"Pipercillin/Tazobactam"]
["B8","A20",null,null,null,"Tetracycline"]
["B8","A21",null,null,null,"Vancomycin"]
["B8","A0"]
["B8","A0"]
["B9","A0"]
["B9","A0",null,null,"Vancomycin resistant Enterococcus species"]
["B9","A0",null,null,null,null,"Culture: Blood",null,"Culture: Urine",null,"Culture: Sputum",null,"Culture: Wound",null,"Culture: Combined"]
["B9","A0",null,null,null,null,"# of Isolates","Percent","# of Isolates","Percent","# of Isolates","Percent","# of Isolates","Percent","# of Isolates","Percent"]
["B9","A1",null,null,null,"Ampicillin"]
["B9","A2",null,null,null,"Amoxicillin/Clavunate"]
["B9","A3",null,null,null,"Ampicillin/Sulbactam"]
["B9","A4",null,null,null,"Bactrim (Trimethoprim/Sulfamethoxazole)"]
["B9","A5",null,null,null,"Cefazolin"]
["B9","A6",null,null,null,"Cefepime"]
["B9","A7",null,null,null,"Cefoxitin"]
["B9","A8",null,null,null,"Ceftazidime"]
["B9","A9",null,null,null,"Ceftriaxone"]
["B9","A10",null,null,null,"Ciprofloxacin"]
["B9","A11",null,null,null,"Clindamycin"]
["B9","A12",null,null,null,"Erythromycin"]
["B9","A13",null,null,null,"Gentamicin"]
["B9","A14",null,null,null,"Imipenem"]
["B9","A15",null,null,null,"Levofloxacin"]
["B9","A16",null,null,null,"Linezolid"]
["B9","A17",null,null,null,"Nitrofurantoin"]
["B9","A18",null,null,null,"Oxacillin"]
["B9","A19",null,null,null,"Pipercillin/Tazobactam"]
["B9","A20",null,null,null,"Tetracycline"]
["B9","A21",null,null,"AHRQ Pub. No. 17-0006-7-EF","Vancomycin"]
["B9","A0",null,null,"2016 October"]
["B9","A0"]

{"sheet":"Step 03 - Output Report","index":4,"n_rows":53,"n_cols":14,"rows_kept":53,"cut":false,"hidden":false,"merged":[[51,11,51,14],[52,8,52,11]]}
[]
[]
[]
[]
["Nursing Home:"]
["Name",null,{"$f":"'Step 01 - Select'!C6","v":"VA Nursing Home of JP"}]
["Address 1",null,{"$f":"'Step 01 - Select'!C7","v":"150 Valparaiso Ave"}]
["Address 2",null,{"$f":"'Step 01 - Select'!C8","v":"Suit 100"}]
["City, State  Zip",null,{"$f":"CONCATENATE('Step 01 - Select'!C9,\", \",'Step 01 - Select'!E9,\"    \", 'Step 01 - Select'!G9)","v":"Houston, TX    77095"}]
[]
["Contacts:"]
["NH Director",null,{"$f":"'Step 01 - Select'!D12","v":"Jon Doe"}]
["Medical Director",null,{"$f":"'Step 01 - Select'!D13","v":"David Pont"}]
["Director of Nursing",null,{"$f":"'Step 01 - Select'!D14","v":"Kiki Wiki"}]
["Infection Control Specialist/Nurse",null,{"$f":"'Step 01 - Select'!D15","v":"Phemi Nemorroni"}]
["Project Champion",null,{"$f":"'Step 01 - Select'!D16","v":"Johannes Fizzle"}]
[]
["Reporting Period "]
["From:",null,{"$f":"'Step 01 - Select'!C19","v":"2010-12-02"}]
["To:",null,{"$f":"'Step 01 - Select'!E19","v":"2011-01-31"}]
[]
["                                                    Nursing Home Antimicrobial Stewardship Guide"]
[]
[]
[null,null,null,"B1","B2","B3","B4","B5","B6","B7","B8","B9","B9"]
[null,"A0","Antibiotic Tested","Escherichia coli","Klebsiella pneumoniae","Proteus mirabilis","Pseudomonas aeruginosa","non-MRSA Staphylococcus aureus","MRSA Staphylococcus aureus","Staphylococcus coag. Negative","non-Vancomycin resistant Enterococcus species","Vancomycin resistant Enterococcus species","Vancomycin resistant Enterococcus species",{"$f":"IF(ISNA(VLOOKUP(N25,'SelOpts (hidden)'!$A:$B,2,0)),\"\",VLOOKUP(N25,'SelOpts (hidden)'!$A:$B,2,0))","v":""}]
[null,"A0","# of Isolates‡",0,0,0,0,0,0,0,0,0,0]
[null,"A1","Ampicillin",0,0,0,0,0,0,0,0,0,0]
[null,"A2","Amoxicillin/Clavunate",0,0,0,0,0,0,0,0,0,0]
[null,"A3","Ampicillin/Sulbactam",0,0,0,0,0,0,0,0,0,0]
[null,"A4","Bactrim (Trimethoprim/Sulfamethoxazole)",0,0,0,0,0,0,0,0,0,0]
[null,"A5","Cefazolin",0,0,0,0,0,0,0,0,0,0]
[null,"A6","Cefepime",0,0,0,0,0,0,0,0,0,0]
[null,"A7","Cefoxitin",0,0,0,0,0,0,0,0,0,0]
[null,"A8","Ceftazidime",0,0,0,0,0,0,0,0,0,0]
[null,"A9","Ceftriaxone",0,0,0,0,0,0,0,0,0,0]
[null,"A10","Ciprofloxacin",0,0,0,0,0,0,0,0,0,0]
[null,"A11","Clindamycin",0,0,0,0,0,0,0,0,0,0]
[null,"A12","Erythromycin",0,0,0,0,0,0,0,0,0,0]
[null,"A13","Gentamicin",0,0,0,0,0,0,0,0,0,0]
[null,"A14","Imipenem",0,0,0,0,0,0,0,0,0,0]
[null,"A15","Levofloxacin",0,0,0,0,0,0,0,0,0,0]
[null,"A16","Linezolid",0,0,0,0,0,0,0,0,0,0]
[null,"A17","Nitrofurantoin",0,0,0,0,0,0,0,0,0,0]
[null,"A18","Oxacillin",0,0,0,0,0,0,0,0,0,0]
[null,"A19","Pipercillin/Tazobactam",0,0,0,0,0,0,0,0,0,0]
[null,"A20","Tetracycline",0,0,0,0,0,0,0,0,0,0]
[null,"A21","Vancomycin",0,0,0,0,0,0,0,0,0,0]
[null,"A21","Vancomycin",0,0,0,0,0,0,0,0,0,0]
[null,null,"* Light blue bacteria are Gram-negative, and dark blue bacteria are gram-positive. Light pink antibiotics are Oral, and dark pink antibiotics are IV."]
[null,null,"* Organisms with between 10 and 30 total isolates should be interpreted with caution, as small numbers may bias the group susceptibilities.",null,null,null,null,null,null,null,null,"       AHRQ Pub. No. 17-0006-7-EF"]
[null,null,"‡ These are pooled isolates by species Blood, Urine, Sputum, Wound, and Combined specimens.",null,null,null,null,null,null,null,null,"  2016 October"]
[null,null,"† MRSA = Methicillin-resistant Staph aureus, which represents a subset of all Staph aureus isolates.",null,null,null,"Nursing Home Antimicrobial Stewardship Guide",null,"Nursing Home Antimicrobial Stewardship Guide"]

{"sheet":"Sheet1","index":5,"n_rows":0,"n_cols":0,"rows_kept":0,"cut":false,"hidden":false,"merged":[]}